{"text_format":"1","workbook":"xlsx","n_sheets":12,"sheets":["ORÇ. DESON.","ORÇ. SEM DESON.","MEM.CALC.","CRONOGRAMA","RESUMO","Plan1","BDI DESON.","BDI SEM DESON.","L.S.","L.S SEM DESON.","COMP. CIVIL","ETAPAS DA OBRA"],"not_rendered":{"charts":0,"images":4,"macros":1,"external_links":2,"defined_names":41,"comments":0,"pivot_tables":0},"unopened":[],"bounds":{"document_bytes":16777216,"sheet_cells":100000,"rows_first":2000,"rows_last":500,"rows_between":2000,"halvings":0,"cell_chars":16384,"cell_head_chars":4096},"cells_cut":0,"cells_raw":0,"read":"whole","date_system":"1900"}

{"sheet":"ORÇ. DESON.","index":0,"n_rows":45,"n_cols":24,"rows_kept":45,"cut":false,"hidden":false,"merged":[[7,11,7,19],[9,11,9,19],[44,11,44,20],[4,13,4,17],[42,11,42,13],[42,16,42,17],[40,11,40,13],[40,16,40,17],[41,11,41,13],[41,16,41,17],[1,11,1,19],[2,11,2,19],[3,11,3,19],[5,11,5,19],[6,11,6,19]]}
[]
[null,null,null,null,null,null,null,null,null,null,null,"GOVERNO DO ESTADO DO PIAUÍ"]
[null,null,null,null,null,null,null,null,null,null,null,"SECRETARIA DE ESTADO DA ADMINISTRAÇÃO E PREVIDÊNCIA DO PIAUÍ - SEADPREV"]
[null,null,null,null,null,null,null,null,null,null,null,"UNIDADE DE MODERNIZAÇÃO ADMINISTRATIVA - UMA"]
[]
[null,null,null,null,null,null,null,null,null,null,null,"MUNICÍPIO: TERESINA - PI"]
[null,null,null,null,null,null,null,null,null,null,null,"OBRA: REVITALIZAÇÃO: CAMPO DE FUTEBOL"]
[null,null,null,null,null,null,null,null,null,null,null,{"$f":"TODAY()","v":"2021-03-04"}]
[]
[null,null,null,null,null,null,null,null,null,null,null,"PLANILHA ORÇAMENTÁRIA (DESONERADA)"]
[]
[null,null,null,null,null,null,null,null,null,null,null,"DATA-BASE: SINAPI - 01/2021 - Piauí - ORSE DEZEMBRO.2019",null,null,null,null,"L.S.=",{"$f":"L.S.!G49","v":83.37},"BDI=",{"$f":"'BDI DESON.'!E34","v":0.25690000000000002}]
[]
[null,{"$f":"COLUMN()","v":2},{"$f":"COLUMN()","v":3},{"$f":"COLUMN()","v":4},{"$f":"COLUMN()","v":5},{"$f":"COLUMN()","v":6},{"$f":"COLUMN()","v":7},{"$f":"COLUMN()","v":8},{"$f":"COLUMN()","v":9},{"$f":"COLUMN()","v":10},{"$f":"COLUMN()","v":11},"REFER.","CÓDIGO","ÍTEM","DESCRIÇÃO","UNIDADE","QUANT.","CUSTO UNITÁRIO","CUSTO COM BDI","CUSTO PARCIAL"]
[null,null,null,null,null,null,null,null,null,null,null," 1 ",null,null,"ADMINISTRAÇÃO LOCAL DA OBRA",null,null,null,null,{"$f":"SUM(T16:T17)","v":4952.88},{"$f":"T15 / 114551.27","v":4.3200000000000002E-2}]
{"$rows_left_out":31}
{"sheet":"ORÇ. SEM DESON.","index":1,"n_rows":45,"n_cols":33,"rows_kept":45,"cut":false,"hidden":false,"merged":[[6,11,6,19],[7,11,7,19],[9,11,9,19],[12,25,12,26],[12,27,12,28],[1,11,1,19],[2,11,2,19],[3,11,3,19],[4,13,4,17],[5,11,5,19],[42,16,42,17],[40,11,40,13],[40,16,40,17],[44,11,44,20],[12,31,12,32],[12,29,12,30],[41,11,41,13],[41,16,41,17],[42,11,42,13]]}
[]
[null,null,null,null,null,null,null,null,null,null,null,"GOVERNO DO ESTADO DO PIAUÍ"]
[null,null,null,null,null,null,null,null,null,null,null,"SECRETARIA DE ESTADO DA ADMINISTRAÇÃO E PREVIDÊNCIA DO PIAUÍ - SEADPREV"]
[null,null,null,null,null,null,null,null,null,null,null,"UNIDADE DE MODERNIZAÇÃO ADMINISTRATIVA - UMA",null,null,null,null,null,null,null,null,null,null,null,null,null,""]
[]
[null,null,null,null,null,null,null,null,null,null,null,"MUNICÍPIO: TERESINA - PI"]
[null,null,null,null,null,null,null,null,null,null,null,"OBRA: REVITALIZAÇÃO: CAMPO DE FUTEBOL"]
[null,null,null,null,null,null,null,null,null,null,null,{"$f":"TODAY()","v":"2021-03-04"}]
[]
[null,null,null,null,null,null,null,null,null,null,null,"PLANILHA ORÇAMENTÁRIA (SEM DESONERADA)"]
[]
[null,null,null,null,null,null,null,null,null,null,null,"DATA-BASE: SINAPI - 01/2021 - Piauí - ORSE DEZEMBRO.2019",null,null,null,null,"L.S.=",{"$f":"'L.S SEM DESON.'!G49","v":112.15},"BDI=",{"$f":"'BDI SEM DESON.'!E34","v":0.1971}]
[null,null,null,null,null,null,null,null,null,null,null,null,null,null,null,null,null,null,null,null,null,null,null,null,null,"MEMÓRIA",null,"DESCRITIVO",null,"CRONOGRAMA",null,"RESUMO"]
[null,{"$f":"COLUMN()","v":2},{"$f":"COLUMN()","v":3},{"$f":"COLUMN()","v":4},{"$f":"COLUMN()","v":5},{"$f":"COLUMN()","v":6},{"$f":"COLUMN()","v":7},{"$f":"COLUMN()","v":8},{"$f":"COLUMN()","v":9},{"$f":"COLUMN()","v":10},{"$f":"COLUMN()","v":11},"REFER.","CÓDIGO","ÍTEM","DESCRIÇÃO","UNIDADE","QUANT.","CUSTO UNITÁRIO","CUSTO COM BDI","CUSTO PARCIAL",null,null,null,null,null,{"$f":"COLUMN()","v":26},{"$f":"COLUMN()","v":27},{"$f":"COLUMN()","v":28},{"$f":"COLUMN()","v":29},{"$f":"COLUMN()","v":30},{"$f":"COLUMN()","v":31},{"$f":"COLUMN()","v":32},{"$f":"COLUMN()","v":33}]
[null,null,null,null,null,null,null,null,null,null,null," 1 ",null,null,"ADMINISTRAÇÃO LOCAL DA OBRA",null,null,null,null,{"$f":"SUM(T16:T17)","v":5436.36},{"$f":"T15 / 112925.1","v":4.8099999999999997E-2}]
{"$rows_left_out":31}
{"sheet":"MEM.CALC.","index":2,"n_rows":61,"n_cols":16,"rows_kept":61,"cut":false,"hidden":false,"merged":[[58,1,58,15],[59,2,59,5],[55,2,55,5],[56,1,56,5],[60,1,60,5],[53,1,53,15],[41,2,41,5],[42,1,42,5],[44,2,44,5],[45,1,45,5],[50,2,50,5],[51,1,51,5],[47,2,47,5],[48,1,48,5],[34,1,34,5],[38,2,38,5],[39,1,39,5],[37,1,37,15],[36,1,36,15],[16,2,16,5],[17,1,17,5],[19,2,19,5],[30,1,30,5],[33,2,33,5],[29,2,29,5],[20,1,20,5],[23,2,23,5],[24,1,24,5],[26,2,26,5],[27,1,27,5],[22,1,22,15],[32,1,32,15],[0,0,0,15],[1,0,1,15],[2,0,2,15],[3,10,3,11],[4,2,4,5],[13,2,13,5],[14,1,14,5],[5,1,5,15],[6,2,6,5],[7,1,7,5],[10,1,10,5],[9,2,9,5],[12,1,12,15]]}
[{"$f":"'ORÇ. DESON.'!L6","v":"MUNICÍPIO: TERESINA - PI"}]
[{"$f":"'ORÇ. DESON.'!L7","v":"OBRA: REVITALIZAÇÃO: CAMPO DE FUTEBOL"}]
["MEMÓRIA DE CÁLCULO"]
[null,{"$f":"'ORÇ. DESON.'!L12","v":"DATA-BASE: SINAPI - 01/2021 - Piauí - ORSE DEZEMBRO.2019"},null,null,null,null,null,null,null,null,"LEIS SOCIAIS (%):",null,{"$f":"LEI","v":82.44},null,"BDI (%):",{"$f":"'BDI DESON.'!E34","v":0.25690000000000002}]
["ITEM","CÓDIGO","DESCRIÇÃO",null,null,null,"UNID","QUANT","COEF","COMP (m)","LARG (m)","ALT (m)","ÁREA (m2)","VOL (m3)","PARCIAL","TOTAL"]
[1,"ADMINISTRAÇÃO LOCAL"]
["1.1",{"$f":"'ORÇ. DESON.'!M16","v":" 90777 "},{"$f":"'ORÇ. DESON.'!O16","v":"ENGENHEIRO CIVIL DE OBRA JUNIOR COM ENCARGOS COMPLEMENTARES"},null,null,null,{"$f":"'ORÇ. DESON.'!P16","v":"H"},null,null,null,null,null,null,null,null,{"$f":"SUM(O7:O9)","v":26}]
["1.1.1",null,null,null,null,null,null,26,null,null,null,null,{"$f":"IF(COUNTA(J8:L8)=2,ROUND(PRODUCT(J8:L8),2),\"\")","v":""},{"$f":"IF(OR(COUNTA(J8:L8)=3,AND(COUNTA(J8:L8)=1,M8<>\"\")),ROUND(PRODUCT(J8:M8),2),\"\")","v":""},{"$f":"IF(N8<>\"\",ROUND(PRODUCT(H8,I8,N8),2),IF(M8<>\"\",ROUND(PRODUCT(H8,I8,M8),2),ROUND(PRODUCT(H8:L8),2)))","v":26}]
[]
[" 1.2 ",{"$f":"'ORÇ. DESON.'!M17","v":" 90780 "},{"$f":"'ORÇ. DESON.'!O17","v":"MESTRE DE OBRAS COM ENCARGOS COMPLEMENTARES"},null,null,null,{"$f":"G7","v":"H"},null,null,null,null,null,null,null,null,{"$f":"SUM(O10:O12)","v":33}]
["1.2.1",null,null,null,null,null,null,33,null,null,null,null,null,{"$f":"IF(OR(COUNTA(J11:L11)=3,AND(COUNTA(J11:L11)=1,M11<>\"\")),ROUND(PRODUCT(J11:M11),2),\"\")","v":""},{"$f":"IF(N11<>\"\",ROUND(PRODUCT(H11,I11,N11),2),IF(M11<>\"\",ROUND(PRODUCT(H11,I11,M11),2),ROUND(PRODUCT(H11:L11),2)))","v":33}]
[]
[2,{"$f":"'ORÇ. DESON.'!O18","v":"SERVIÇOS INICIAIS/ TERRAPLENAGEM"}]
["2.1"," 74209/001 ",{"$f":"'ORÇ. DESON.'!O19","v":"PLACA DE OBRA EM CHAPA DE ACO GALVANIZADO"},null,null,null,{"$f":"'ORÇ. DESON.'!P23","v":"m²"},null,null,null,null,null,null,null,null,{"$f":"SUM(O14:O16)","v":4.5}]
["2.1.1",null,null,null,null,null,null,null,null,3,1.5,null,{"$f":"IF(COUNTA(J15:L15)=2,ROUND(PRODUCT(J15:L15),2),\"\")","v":4.5},{"$f":"IF(OR(COUNTA(J15:L15)=3,AND(COUNTA(J15:L15)=1,M15<>\"\")),ROUND(PRODUCT(J15:M15),2),\"\")","v":""},{"$f":"IF(N15<>\"\",ROUND(PRODUCT(H15,I15,N15),2),IF(M15<>\"\",ROUND(PRODUCT(H15,I15,M15),2),ROUND(PRODUCT(H15:L15),2)))","v":4.5}]
{"$rows_left_out":47}
{"sheet":"CRONOGRAMA","index":3,"n_rows":269,"n_cols":12,"rows_kept":269,"cut":false,"hidden":false,"merged":[[7,3,7,9],[9,3,9,9],[1,3,1,9],[2,3,2,9],[3,3,3,9],[4,3,4,9],[5,3,5,9],[6,3,6,9]]}
[{"$f":"ROW(36:36)","v":36},{"$f":"COLUMN(K:K)","v":11}]
[null,null,null,{"$f":"'ORÇ. DESON.'!L2","v":"GOVERNO DO ESTADO DO PIAUÍ"},null,null,null,null,null,null,"#"]
[null,null,null,{"$f":"'ORÇ. DESON.'!L3","v":"SECRETARIA DE ESTADO DA ADMINISTRAÇÃO E PREVIDÊNCIA DO PIAUÍ - SEADPREV"},null,null,null,null,null,null,"#"]
[null,null,null,{"$f":"'ORÇ. DESON.'!L4","v":"UNIDADE DE MODERNIZAÇÃO ADMINISTRATIVA - UMA"},null,null,null,null,null,null,"#"]
[]
[null,null,null,{"$f":"'ORÇ. DESON.'!L6","v":"MUNICÍPIO: TERESINA - PI"},null,null,null,null,null,null,"#"]
[null,null,null,{"$f":"'ORÇ. DESON.'!L7","v":"OBRA: REVITALIZAÇÃO: CAMPO DE FUTEBOL"},null,null,null,null,null,null,"#"]
[null,null,null,{"$f":"'ORÇ. DESON.'!L8","v":"2021-03-04"},null,null,null,null,null,null,"#"]
[]
[null,null,null,"C R O N O G R A M A     F Í S I C O   - F I N A N C E I R O ",null,null,null,null,null,null,"#"]
[]
[null,null,"ITEM","DISCRIMINAÇÃO DOS SERVIÇOS","R$","%",0,{"$f":"INDIRECT(ADDRESS(ROW(),COLUMN()-1))+30","v":30},60,90]
[]
[]
[]
{"$rows_left_out":255}
{"sheet":"RESUMO","index":4,"n_rows":25,"n_cols":5,"rows_kept":25,"cut":false,"hidden":true,"merged":[[22,2,22,4],[1,2,1,4],[10,1,10,3],[5,2,5,4],[6,2,6,4],[7,2,7,4],[9,2,9,4],[2,2,2,4],[3,2,3,4]]}
[]
[null,null,{"$f":"'ORÇ. DESON.'!L2","v":"GOVERNO DO ESTADO DO PIAUÍ"}]
[null,null,{"$f":"'ORÇ. DESON.'!L3","v":"SECRETARIA DE ESTADO DA ADMINISTRAÇÃO E PREVIDÊNCIA DO PIAUÍ - SEADPREV"}]
[null,null,{"$f":"'ORÇ. DESON.'!L4","v":"UNIDADE DE MODERNIZAÇÃO ADMINISTRATIVA - UMA"}]
[]
[null,null,{"$f":"'ORÇ. DESON.'!L6","v":"MUNICÍPIO: TERESINA - PI"}]
[null,null,{"$f":"'ORÇ. DESON.'!L7","v":"OBRA: REVITALIZAÇÃO: CAMPO DE FUTEBOL"}]
[null,null,{"$f":"TODAY()","v":"2021-03-04"}]
[]
[null,null,"PLANILHA RESUMO"]
[]
[null,null,"ÍTEM","DESCRIÇÃO","PREÇO TOTAL"]
[]
[{"$f":"ROW(20:20)","v":20},{"$f":"ROW()","v":14},{"$f":"'ORÇ. DESON.'!#REF!","v":{"$error":"#REF!"}},{"$f":"IF(C14=\"\",\"\",INDEX(ORÇAMENTO,MATCH(C14,'ORÇ. DESON.'!$N:$N,0),4))","v":{"$error":"#REF!"}},{"$f":"'ORÇ. DESON.'!#REF!","v":{"$error":"#REF!"}}]
[]
{"$rows_left_out":11}
{"sheet":"Plan1","index":5,"n_rows":32,"n_cols":7,"rows_kept":32,"cut":false,"hidden":true,"merged":[[29,0,29,7],[3,0,3,7],[2,0,2,7],[1,0,1,7],[6,0,6,7],[9,0,9,7],[18,0,18,1]]}
[]
["MUNICÍPIO: TERESINA"]
["OBRA: ADEQUAÇÃO DE SALA AEE - CETI JOAO HENRIQUE ALMEIDA SOUSA"]
["ADMINISTRAÇÃO DE OBRA"]
[]
[]
["MEMÓRIA DE CÁLCULO"]
["Atividade: ","Contratação de técnico de segurança do trabalho "]
[]
["Honorários e Remunerações"]
[]
["FONTE","CÓDIGO","DESCRIÇÃO","UNIDADE","COEF.","CUSTO UNITÁRIO1","TOTAL"]
["iSINAPI",40944,{"$f":"IF(A13=\"SINAPI\",VLOOKUP(B13,SINAPI,2,FALSE),IF(A13=\"iSINAPI\",VLOOKUP(B13,iSINAPI,2,FALSE),IF(A13=\"SEINFRA\",VLOOKUP(B13,SEINFRA,2,FALSE),IF(A13=\"iSEINFRA\",VLOOKUP(B13,iSEINFRA,2,FALSE),IF(A13=\"ORSE\",VLOOKUP(B13,ORSE,2,FALSE),IF(A13=\"iORSE\",VLOOKUP(B13,iORSE,2,FALSE),\"NÃO ENCONTRADO\"))))))","v":{"$error":"#REF!"}},{"$f":"IF(A13=\"SINAPI\",VLOOKUP(B13,SINAPI,3,FALSE),IF(A13=\"iSINAPI\",VLOOKUP(B13,iSINAPI,3,FALSE),IF(A13=\"SEINFRA\",VLOOKUP(B13,SEINFRA,3,FALSE),IF(A13=\"iSEINFRA\",VLOOKUP(B13,iSEINFRA,3,FALSE),IF(A13=\"ORSE\",VLOOKUP(B13,ORSE,3,FALSE),IF(A13=\"iORSE\",VLOOKUP(B13,iORSE,3,FALSE),\"x\"))))))","v":{"$error":"#REF!"}},1,{"$f":"IF(A13=\"SINAPI\",VLOOKUP(B13,SINAPI,4,FALSE),IF(A13=\"iSINAPI\",VLOOKUP(B13,iSINAPI,4,FALSE),IF(A13=\"SEINFRA\",VLOOKUP(B13,SEINFRA,4,FALSE),IF(A13=\"iSEINFRA\",VLOOKUP(B13,iSEINFRA,4,FALSE),IF(A13=\"ORSE\",VLOOKUP(B13,ORSE,4,FALSE),IF(A13=\"iORSE\",VLOOKUP(B13,iORSE,4,FALSE),\"\"))))))","v":{"$error":"#REF!"}},{"$f":"ROUND(E13*F13,2)","v":{"$error":"#REF!"}}]
["iSINAPI",40863,{"$f":"IF(A14=\"SINAPI\",VLOOKUP(B14,SINAPI,2,FALSE),IF(A14=\"iSINAPI\",VLOOKUP(B14,iSINAPI,2,FALSE),IF(A14=\"SEINFRA\",VLOOKUP(B14,SEINFRA,2,FALSE),IF(A14=\"iSEINFRA\",VLOOKUP(B14,iSEINFRA,2,FALSE),IF(A14=\"ORSE\",VLOOKUP(B14,ORSE,2,FALSE),IF(A14=\"iORSE\",VLOOKUP(B14,iORSE,2,FALSE),\"NÃO ENCONTRADO\"))))))","v":{"$error":"#REF!"}},{"$f":"IF(A14=\"SINAPI\",VLOOKUP(B14,SINAPI,3,FALSE),IF(A14=\"iSINAPI\",VLOOKUP(B14,iSINAPI,3,FALSE),IF(A14=\"SEINFRA\",VLOOKUP(B14,SEINFRA,3,FALSE),IF(A14=\"iSEINFRA\",VLOOKUP(B14,iSEINFRA,3,FALSE),IF(A14=\"ORSE\",VLOOKUP(B14,ORSE,3,FALSE),IF(A14=\"iORSE\",VLOOKUP(B14,iORSE,3,FALSE),\"x\"))))))","v":{"$error":"#REF!"}},1,{"$f":"IF(A14=\"SINAPI\",VLOOKUP(B14,SINAPI,4,FALSE),IF(A14=\"iSINAPI\",VLOOKUP(B14,iSINAPI,4,FALSE),IF(A14=\"SEINFRA\",VLOOKUP(B14,SEINFRA,4,FALSE),IF(A14=\"iSEINFRA\",VLOOKUP(B14,iSEINFRA,4,FALSE),IF(A14=\"ORSE\",VLOOKUP(B14,ORSE,4,FALSE),IF(A14=\"iORSE\",VLOOKUP(B14,iORSE,4,FALSE),\"\"))))))","v":{"$error":"#REF!"}},{"$f":"ROUND(E14*F14,2)","v":{"$error":"#REF!"}}]
["iSINAPI",40864,{"$f":"IF(A15=\"SINAPI\",VLOOKUP(B15,SINAPI,2,FALSE),IF(A15=\"iSINAPI\",VLOOKUP(B15,iSINAPI,2,FALSE),IF(A15=\"SEINFRA\",VLOOKUP(B15,SEINFRA,2,FALSE),IF(A15=\"iSEINFRA\",VLOOKUP(B15,iSEINFRA,2,FALSE),IF(A15=\"ORSE\",VLOOKUP(B15,ORSE,2,FALSE),IF(A15=\"iORSE\",VLOOKUP(B15,iORSE,2,FALSE),\"NÃO ENCONTRADO\"))))))","v":{"$error":"#REF!"}},{"$f":"IF(A15=\"SINAPI\",VLOOKUP(B15,SINAPI,3,FALSE),IF(A15=\"iSINAPI\",VLOOKUP(B15,iSINAPI,3,FALSE),IF(A15=\"SEINFRA\",VLOOKUP(B15,SEINFRA,3,FALSE),IF(A15=\"iSEINFRA\",VLOOKUP(B15,iSEINFRA,3,FALSE),IF(A15=\"ORSE\",VLOOKUP(B15,ORSE,3,FALSE),IF(A15=\"iORSE\",VLOOKUP(B15,iORSE,3,FALSE),\"x\"))))))","v":{"$error":"#REF!"}},1,{"$f":"IF(A15=\"SINAPI\",VLOOKUP(B15,SINAPI,4,FALSE),IF(A15=\"iSINAPI\",VLOOKUP(B15,iSINAPI,4,FALSE),IF(A15=\"SEINFRA\",VLOOKUP(B15,SEINFRA,4,FALSE),IF(A15=\"iSEINFRA\",VLOOKUP(B15,iSEINFRA,4,FALSE),IF(A15=\"ORSE\",VLOOKUP(B15,ORSE,4,FALSE),IF(A15=\"iORSE\",VLOOKUP(B15,iORSE,4,FALSE),\"\"))))))","v":{"$error":"#REF!"}},{"$f":"ROUND(E15*F15,2)","v":{"$error":"#REF!"}}]
{"$rows_left_out":18}
{"sheet":"BDI DESON.","index":6,"n_rows":428,"n_cols":7,"rows_kept":428,"cut":false,"hidden":false,"merged":[[32,2,32,4],[33,2,33,3],[3,2,3,4],[2,2,2,4],[1,2,1,4],[5,2,5,4],[6,2,6,4],[11,2,11,4],[12,2,12,4],[14,2,14,4],[7,2,7,4],[9,2,9,4]]}
[]
[null,null,{"$f":"'ORÇ. DESON.'!L2","v":"GOVERNO DO ESTADO DO PIAUÍ"}]
[null,null,{"$f":"'ORÇ. DESON.'!L3","v":"SECRETARIA DE ESTADO DA ADMINISTRAÇÃO E PREVIDÊNCIA DO PIAUÍ - SEADPREV"}]
[null,null,{"$f":"'ORÇ. DESON.'!L4","v":"UNIDADE DE MODERNIZAÇÃO ADMINISTRATIVA - UMA"}]
[]
[null,null,{"$f":"'ORÇ. DESON.'!L6","v":"MUNICÍPIO: TERESINA - PI"}]
[null,null,{"$f":"'ORÇ. DESON.'!L7","v":"OBRA: REVITALIZAÇÃO: CAMPO DE FUTEBOL"}]
[null,null,{"$f":"'ORÇ. DESON.'!L8","v":"2021-03-04"}]
[]
[null,null,"BONIFICAÇÕES E DESPESAS INDIRETAS ( DESONERADO)"]
[]
[null,null,"COMPOSIÇÃO DO BDI"]
[]
[null,null,"ITEM","COMPONENTE DO BDI","PERCENTUAL"]
[]
{"$rows_left_out":414}
{"sheet":"BDI SEM DESON.","index":7,"n_rows":183,"n_cols":7,"rows_kept":183,"cut":false,"hidden":false,"merged":[[33,2,33,3],[1,2,1,4],[2,2,2,4],[3,2,3,4],[5,2,5,4],[6,2,6,4],[7,2,7,4],[9,2,9,4],[11,2,11,4],[12,2,12,4],[14,2,14,4],[32,2,32,4]]}
[]
[null,null,{"$f":"'ORÇ. DESON.'!L2","v":"GOVERNO DO ESTADO DO PIAUÍ"}]
[null,null,{"$f":"'ORÇ. DESON.'!L3","v":"SECRETARIA DE ESTADO DA ADMINISTRAÇÃO E PREVIDÊNCIA DO PIAUÍ - SEADPREV"}]
[null,null,{"$f":"'ORÇ. DESON.'!L4","v":"UNIDADE DE MODERNIZAÇÃO ADMINISTRATIVA - UMA"}]
[]
[null,null,{"$f":"'ORÇ. DESON.'!L6","v":"MUNICÍPIO: TERESINA - PI"}]
[null,null,{"$f":"'ORÇ. DESON.'!L7","v":"OBRA: REVITALIZAÇÃO: CAMPO DE FUTEBOL"}]
[null,null,{"$f":"'ORÇ. DESON.'!L8","v":"2021-03-04"}]
[]
[null,null,"BONIFICAÇÕES E DESPESAS INDIRETAS (SEM DESONERADO)"]
[]
[null,null,"COMPOSIÇÃO DO BDI"]
[]
[null,null,"ITEM","COMPONENTE DO BDI","PERCENTUAL"]
[]
{"$rows_left_out":169}
{"sheet":"L.S.","index":8,"n_rows":428,"n_cols":8,"rows_kept":428,"cut":false,"hidden":false,"merged":[[44,2,44,5],[48,1,48,5],[46,1,46,7],[43,2,43,5],[33,1,33,7],[34,2,34,5],[35,2,35,5],[36,2,36,5],[37,2,37,5],[38,2,38,5],[39,2,39,5],[41,1,41,7],[42,2,42,5],[31,2,31,5],[20,1,20,7],[21,2,21,5],[22,2,22,5],[23,2,23,5],[24,2,24,5],[25,2,25,5],[26,2,26,5],[27,2,27,5],[28,2,28,5],[29,2,29,5],[30,2,30,5],[18,2,18,5],[7,2,7,5],[6,1,6,7],[2,1,2,7],[3,1,3,7],[5,5,5,6],[13,2,13,5],[14,2,14,5],[15,2,15,5],[16,2,16,5],[17,2,17,5],[8,1,8,7],[9,2,9,5],[10,2,10,5],[11,2,11,5],[12,2,12,5]]}
[]
[]
[null,"SINAPI- SISTEMA NACIONAL DE PESQUISA DE CUSTO E ÍNDICES DA CONSTRUÇÃO CIVIL"]
[null,"ENCARGOS SOCIAIS SOBRE PREÇOS DA MÃO DE OBRA HORISTA E MENSALISTA    (COM DESONERAÇÃO)"]
[]
[null,"UF: PIAUÍ"]
[null,"ENCARGOS SOCIAIS SOBRE A MÃO DE OBRA"]
[null,"CÓDIGO","DESCRIÇÃO",null,null,null,"HORISTA %","MENSALISTA %"]
[null,"GRUPO A"]
[null,"A1","INSS",null,null,null,0,0]
[null,"A2","SESI",null,null,null,1.5,1.5]
[null,"A3","SENAI",null,null,null,1,1]
[null,"A4","INCRA",null,null,null,0.2,0.2]
[null,"A5","SEBRAE",null,null,null,0.6,0.6]
[null,"A6","Salário-Educação",null,null,null,2.5,2.5]
{"$rows_left_out":414}
{"sheet":"L.S SEM DESON.","index":9,"n_rows":428,"n_cols":8,"rows_kept":428,"cut":false,"hidden":false,"merged":[[14,2,14,5],[3,1,3,7],[5,5,5,6],[6,1,6,7],[7,2,7,5],[8,1,8,7],[9,2,9,5],[10,2,10,5],[11,2,11,5],[12,2,12,5],[13,2,13,5],[27,2,27,5],[15,2,15,5],[16,2,16,5],[17,2,17,5],[18,2,18,5],[20,1,20,7],[21,2,21,5],[22,2,22,5],[23,2,23,5],[24,2,24,5],[25,2,25,5],[26,2,26,5],[41,1,41,7],[28,2,28,5],[29,2,29,5],[30,2,30,5],[31,2,31,5],[33,1,33,7],[34,2,34,5],[35,2,35,5],[36,2,36,5],[37,2,37,5],[38,2,38,5],[39,2,39,5],[42,2,42,5],[43,2,43,5],[44,2,44,5],[46,1,46,7],[48,1,48,5]]}
[]
[]
[null,"SINAPI- SISTEMA NACIONAL DE PESQUISA DE CUSTO E ÍNDICES DA CONSTRUÇÃO CIVIL"]
[null,"ENCARGOS SOCIAIS SOBRE PREÇOS DA MÃO DE OBRA HORISTA E MENSALISTA    (SEM DESONERAÇÃO)"]
[]
[null,"UF: PIAUÍ"]
[null,"ENCARGOS SOCIAIS SOBRE A MÃO DE OBRA"]
[null,"CÓDIGO","DESCRIÇÃO",null,null,null,"HORISTA %","MENSALISTA %"]
[null,"GRUPO A"]
[null,"A1","INSS",null,null,null,20,20]
[null,"A2","SESI",null,null,null,1.5,1.5]
[null,"A3","SENAI",null,null,null,1,1]
[null,"A4","INCRA",null,null,null,0.2,0.2]
[null,"A5","SEBRAE",null,null,null,0.6,0.6]
[null,"A6","Salário-Educação",null,null,null,2.5,2.5]
{"$rows_left_out":414}
{"sheet":"COMP. CIVIL","index":10,"n_rows":1112,"n_cols":15,"rows_kept":1112,"cut":false,"hidden":false,"merged":[[10,7,10,13],[9,0,9,6],[10,0,10,6],[1,0,1,6],[2,0,2,6],[3,0,3,6],[5,0,5,6],[6,0,6,6],[7,0,7,6]]}
[]
["GOVERNO DO ESTADO DO PIAUÍ"]
[{"$f":"CRONOGRAMA!D3","v":"SECRETARIA DE ESTADO DA ADMINISTRAÇÃO E PREVIDÊNCIA DO PIAUÍ - SEADPREV"}]
[{"$f":"CRONOGRAMA!D4","v":"UNIDADE DE MODERNIZAÇÃO ADMINISTRATIVA - UMA"}]
[]
[{"$f":"'ORÇ. DESON.'!L6","v":"MUNICÍPIO: TERESINA - PI"},null,null,null,null,null,null,null,null,null,null,"MUNICÍPIO: ALEGRETE DO PIAUÍ - PI"]
[{"$f":"'ORÇ. DESON.'!L7","v":"OBRA: REVITALIZAÇÃO: CAMPO DE FUTEBOL"}]
[{"$f":"'ORÇ. DESON.'!L8","v":"2021-03-04"}]
[]
[{"$f":"'ORÇ. DESON.'!L12","v":"DATA-BASE: SINAPI - 01/2021 - Piauí - ORSE DEZEMBRO.2019"}]
["COMPOSIÇÕES ANALÍTICAS AUXILIARES - CONSTRUÇÃO CIVIL - SEAD"]
["Fonte","Código","Descreição","Unid.","Valor sem Desoneração","Valor com Desoneração","Coeficiente","Valor sem Desoneração","Valor com Desoneração",null,null,"DESCRIÇÃO"]
[]
[null,"SEDUC 1","SERVIÇOS PRELIMINARES",null,null,null,null,null,{"$f":"B14","v":"SEDUC 1"},null,{"$f":"IF(A14=\"\",\"\",IF(E14=0,\"ERRO\",\"\"))","v":""}]
[null,"SEDUC 1.01","RETIRADA DE ÁRVORES (Ref. Seinfra C2204)","UN",null,null,{"$f":"SUM(G16)","v":24},null,{"$f":"$B$15","v":"SEDUC 1.01"},null,{"$f":"IF(A15=\"\",\"\",IF(E15=0,\"ERRO\",\"\"))","v":""},"RETIRAR MANUALMENTE ÁRVORES DE MÉDIO A GRANDE PORTE QUE ESTEJAM PRESENTES EM ÁREAS DESTINADAS A NOVA CONSTRUÇÃO OU QUE DEVAM SER REMOVIDAS A CRITÉRIO DA ADMINISTRAÇÃO."]
{"$rows_left_out":1098}
{"sheet":"ETAPAS DA OBRA","index":11,"n_rows":23,"n_cols":1,"rows_kept":23,"cut":false,"hidden":true,"merged":[]}
["ADMINISTRAÇÃO DA OBRA"]
["SERVIÇOS PRELIMINARES"]
["DEMOLIÇÕES E RETIRADAS"]
["MOVIMENTO DE TERRA"]
["INFRAESTRUTURA"]
["SUPERESTRUTURA"]
["PAREDES E DIVISORIAS"]
["COBERTURAS"]
["INSTALAÇÕES HIDRÁULICAS"]
["INSTALAÇÕES SANITÁRIAS"]
["INSTALAÇÕES ELÉTRICAS"]
["INSTALAÇÕES DE GÁS"]
["DRENAGEM PLUVIAL"]
["ESQUADRIAS"]
["PAVIMENTAÇÃO"]
{"$rows_left_out":8}